Reaction Details
TargetHistamine H1 receptor
LigandBDBM50404245
Substrate/Competitorn/a
Meas. Tech.ChEBML_84421
Ki 3.5±n/a nM
Citation Cid, JAlonso, JMAndrés, JIFernández, JGil, PIturrino, LMatesanz, EMeert, TFMegens, ASipido, VKTrabanco, AA Synthesis and structure-activity relationship of 2-(aminoalkyl)-3,3a,8,12b-tetrahydro-2H-dibenzocyclohepta[1,2-b]furan derivatives: a novel series of 5-HT(2A/2C) receptor antagonists. Bioorg Med Chem Lett14:2765-71 (2004) 
 
Histamine H1 receptor
Name:Histamine H1 receptor
Type:G Protein-Coupled Receptor (GPCR)
Mol. Mass.:55808.72
Organism:Homo sapiens (Human)
Description:Cell pellets from SK-N-MC cells transfected with human H1 receptor were used in binding assay.
Residue:487
BDBM50404245
NameBDBM50404245
Synonyms:CHEMBL2112371
TypeSmall organic molecule
Emp. Form.C19H21NO
Mol. Mass.279.3761
SMILESCNC[C@@H]1C[C@@H]2[C@@H](O1)c1ccccc1Cc1ccccc21