Reaction Details
Target5-hydroxytryptamine receptor 2C
LigandBDBM50146351
Substrate/Competitorn/a
Meas. Tech.ChEBML_2954
Ki 0.930000±n/a nM
Citation Cid, JAlonso, JMAndrés, JIFernández, JGil, PIturrino, LMatesanz, EMeert, TFMegens, ASipido, VKTrabanco, AA Synthesis and structure-activity relationship of 2-(aminoalkyl)-3,3a,8,12b-tetrahydro-2H-dibenzocyclohepta[1,2-b]furan derivatives: a novel series of 5-HT(2A/2C) receptor antagonists. Bioorg Med Chem Lett14:2765-71 (2004) 
 
5-hydroxytryptamine receptor 2C
Name:5-hydroxytryptamine receptor 2C
Type:G Protein-Coupled Receptor (GPCR)
Mol. Mass.:51836.79
Organism:Homo sapiens (Human)
Description:P28335
Residue:458
BDBM50146351
NameBDBM50146351
Synonyms:CHEMBL329566 | Dimethyl-[(2R,3aR,12bS)-1-(3,3a,8,12b-tetrahydro-2H-1-oxa-dibenzo[e,h]azulen-2-yl)methyl]-amine
TypeSmall organic molecule
Emp. Form.C20H23NO
Mol. Mass.293.4027
SMILESCN(C)C[C@H]1C[C@H]2[C@H](O1)c1ccccc1Cc1ccccc21