Reaction Details
TargetMatrix metalloproteinase-17
LigandBDBM50146476
Substrate/Competitorn/a
Meas. Tech.ChEBML_106800
IC50 3000±n/a nM
Citation Kamei, NTanaka, TKawai, KMiyawaki, KOkuyama, AMurakami, YArakawa, YHaino, MHarada, TShimano, M Reverse hydroxamate-based selective TACE inhibitors. Bioorg Med Chem Lett14:2897-900 (2004) 
 
Matrix metalloproteinase-17
Name:Matrix metalloproteinase-17
Type:PROTEIN
Mol. Mass.:66652.56
Organism:Homo sapiens (Human)
Description:ChEMBL_1433225
Residue:603
BDBM50146476
NameBDBM50146476
Synonyms:CHEMBL99995 | N-Hydroxy-N-{1-(4-hydroxyimino-cyclohexylidenemethyl)-2-[4-(2-methyl-quinolin-4-ylmethoxy)-benzenesulfonyl]-ethyl}-formamide
TypeSmall organic molecule
Emp. Form.C27H29N3O6S
Mol. Mass.523.601
SMILESCc1cc(COc2ccc(cc2)S(=O)(=O)CC(C=C2CCC(CC2)N=O)N(O)C=O)c2ccccc2n1