Reaction Details
TargetMatrix metalloproteinase-17
LigandBDBM50146471
Substrate/Competitorn/a
Meas. Tech.ChEBML_106800
IC50 220±n/a nM
Citation Kamei, NTanaka, TKawai, KMiyawaki, KOkuyama, AMurakami, YArakawa, YHaino, MHarada, TShimano, M Reverse hydroxamate-based selective TACE inhibitors. Bioorg Med Chem Lett14:2897-900 (2004) 
 
Matrix metalloproteinase-17
Name:Matrix metalloproteinase-17
Type:PROTEIN
Mol. Mass.:66652.56
Organism:Homo sapiens (Human)
Description:ChEMBL_1433225
Residue:603
BDBM50146471
NameBDBM50146471
Synonyms:CHEMBL431226 | N-{1-(1,4-Dioxa-spiro[4.5]dec-8-yl)-2-[4-(2-methyl-quinolin-4-ylmethoxy)-benzenesulfonyl]-ethyl}-N-hydroxy-formamide
TypeSmall organic molecule
Emp. Form.C28H32N2O7S
Mol. Mass.540.628
SMILESCc1cc(COc2ccc(cc2)S(=O)(=O)CC(C2CCC3(CC2)OCCO3)N(O)C=O)c2ccccc2n1