Reaction Details
TargetMatrix metalloproteinase-17
LigandBDBM50146474
Substrate/Competitorn/a
Meas. Tech.ChEBML_106800
IC50 1100±n/a nM
Citation Kamei, NTanaka, TKawai, KMiyawaki, KOkuyama, AMurakami, YArakawa, YHaino, MHarada, TShimano, M Reverse hydroxamate-based selective TACE inhibitors. Bioorg Med Chem Lett14:2897-900 (2004) 
 
Matrix metalloproteinase-17
Name:Matrix metalloproteinase-17
Type:PROTEIN
Mol. Mass.:66652.56
Organism:Homo sapiens (Human)
Description:ChEMBL_1433225
Residue:603
BDBM50146474
NameBDBM50146474
Synonyms:CHEMBL419896 | N-{2-(1,4-Dioxa-spiro[4.5]dec-8-yl)-1-[4-(2-methyl-quinolin-4-ylmethoxy)-benzenesulfonylmethyl]-ethyl}-N-hydroxy-formamide
TypeSmall organic molecule
Emp. Form.C29H34N2O7S
Mol. Mass.554.654
SMILESCc1cc(COc2ccc(cc2)S(=O)(=O)CC(CC2CCC3(CC2)OCCO3)N(O)C=O)c2ccccc2n1