Reaction Details
TargetMatrix metalloproteinase-17
LigandBDBM50146478
Substrate/Competitorn/a
Meas. Tech.ChEBML_106800
IC50 350±n/a nM
Citation Kamei, NTanaka, TKawai, KMiyawaki, KOkuyama, AMurakami, YArakawa, YHaino, MHarada, TShimano, M Reverse hydroxamate-based selective TACE inhibitors. Bioorg Med Chem Lett14:2897-900 (2004) 
 
Matrix metalloproteinase-17
Name:Matrix metalloproteinase-17
Type:PROTEIN
Mol. Mass.:66652.56
Organism:Homo sapiens (Human)
Description:ChEMBL_1433225
Residue:603
BDBM50146478
NameBDBM50146478
Synonyms:CHEMBL98390 | N-Hydroxy-N-{1-(1-isobutyl-piperidin-4-ylmethyl)-2-[4-(2-methyl-quinolin-4-ylmethoxy)-benzenesulfonyl]-ethyl}-formamide
TypeSmall organic molecule
Emp. Form.C30H39N3O5S
Mol. Mass.553.713
SMILESCC(C)CN1CCC(CC(CS(=O)(=O)c2ccc(OCc3cc(C)nc4ccccc34)cc2)N(O)C=O)CC1