Reaction Details
TargetIntegrin alpha-V/beta-3
LigandBDBM50146481
Substrate/Competitorn/a
Meas. Tech.ChEMBL_32659 (CHEMBL642827)
Ki 2.4±n/a nM
Citation Xi, NArvedson, SEisenberg, SHan, NHandley, MHuang, LHuang, QKiselyov, ALiu, QLu, YNunez, GOsslund, TPowers, DTasker, ASWang, LXiang, TXu, SZhang, JZhu, JKendall, RDominguez, C N-Aryl-gamma-lactams as integrin alphavbeta3 antagonists. Bioorg Med Chem Lett14:2905-9 (2004) 
 
Integrin alpha-V/beta-3
Name:Integrin alpha-V/beta-3
Type:Enzyme
Mol. Mass.:n/a
Description:n/a
Components:This complex has 2 components.
Component 1
Name:Integrin alpha-V
Synonyms:ITAV_HUMAN Integrin alpha-V/alpha-5 VNRA Vitronectin receptor | Vitronectin receptor subunit alpha
Type:PROTEIN
Mol. Mass.:116024.92
Organism:Homo sapiens (Human)
Description:ChEMBL_582336
Residue:1048
Component 2
Name:Integrin beta-3
Synonyms:CD_antigen=CD61 GPIIIa ITGB3 Platelet membrane glycoprotein IIIa
Type:Protein
Mol. Mass.:87038.91
Organism:Homo sapiens (Human)
Description:P05106
Residue:788
BDBM50146481
NameBDBM50146481
Synonyms:3-Benzo[1,3]dioxol-5-yl-3-({1-[3-(3-benzyl-ureido)-phenyl]-5-oxo-pyrrolidine-3-carbonyl}-amino)-propionic acid | CHEMBL99709
TypeSmall organic molecule
Emp. Form.C29H28N4O7
Mol. Mass.544.5552
SMILESOC(=O)CC(NC(=O)C1CN(C(=O)C1)c1cccc(NC(=O)NCc2ccccc2)c1)c1ccc2OCOc2c1