Reaction Details
TargetAlpha-2A adrenergic receptor
LigandBDBM50146501
Substrate/Competitorn/a
Meas. Tech.ChEBML_33077
Ki 0.300000±n/a nM
Citation Pastor, JAlcázar, JAlvarez, RMAndrés, JICid, JMDe Lucas, AIDíaz, AFernández, JFont, LMIturrino, LLafuente, CMartínez, SBakker, MHBiesmans, IHeylen, LIMegens, AA Synthesis of 3a,4-dihydro-3H-[1]benzopyrano[4,3-c]isoxazoles, displaying combined 5-HT uptake inhibiting and alpha2-adrenoceptor antagonistic activities. Part 2: Further exploration on the cinnamyl moiety. Bioorg Med Chem Lett14:2917-22 (2004) 
 
Alpha-2A adrenergic receptor
Name:Alpha-2A adrenergic receptor
Type:Enzyme
Mol. Mass.:48979.91
Organism:Homo sapiens (Human)
Description:P08913
Residue:465
BDBM50146501
NameBDBM50146501
Synonyms:(3R,3aS)-3-{4-[3-(2,5-Difluoro-phenyl)-2-methyl-allyl]-piperazin-1-ylmethyl}-7,8-dimethoxy-3a,4-dihydro-3H-chromeno[4,3-c]isoxazole | CHEMBL319119
TypeSmall organic molecule
Emp. Form.C27H31F2N3O4
Mol. Mass.499.5495
SMILESCOc1cc2OC[C@H]3[C@H](CN4CCN(C\C(C)=C\c5cc(F)ccc5F)CC4)ON=C3c2cc1OC