Reaction Details
TargetProtein kinase C alpha type
LigandBDBM50146561
Substrate/Competitorn/a
Meas. Tech.ChEBML_160132
Ki 540±n/a nM
Citation Baba, YOgoshi, YHirai, GYanagisawa, TNagamatsu, KMayumi, SHashimoto, YSodeoka, M Design, synthesis, and structure-activity relationship of new isobenzofuranone ligands of protein kinase C. Bioorg Med Chem Lett14:2963-7 (2004) 
 
Protein kinase C alpha type
Name:Protein kinase C alpha type
Type:Enzyme
Mol. Mass.:76755.65
Organism:Homo sapiens (Human)
Description:The recombinant human PKC enzymes were produced using a baculovirus expression system in SF9 cells
Residue:672
BDBM50146561
NameBDBM50146561
Synonyms:Acetic acid (R)-4-dodecyloxy-1-hydroxymethyl-3-oxo-1,3-dihydro-isobenzofuran-1-ylmethyl ester | CHEMBL102106
TypeSmall organic molecule
Emp. Form.C24H36O6
Mol. Mass.420.539
SMILESCCCCCCCCCCCCOc1cccc2c1C(=O)O[C@]2(CO)COC(C)=O