Reaction Details
TargetVasopressin V2 receptor
LigandBDBM50146577
Substrate/Competitorn/a
Meas. Tech.ChEBML_215032
IC50 0.200000±n/a nM
Citation Xiang, MAChen, RHDemarest, KTGunnet, JLook, RHageman, WMurray, WVCombs, DWPatel, M Synthesis and evaluation of spirobenzazepines as potent vasopressin receptor antagonists. Bioorg Med Chem Lett14:2987-9 (2004) 
 
Vasopressin V2 receptor
Name:Vasopressin V2 receptor
Type:Receptor
Mol. Mass.:40295.28
Organism:Homo sapiens (Human)
Description:P30518
Residue:371
BDBM50146577
NameBDBM50146577
Synonyms:CHEMBL102311 | spirobenzoxazines analogues
TypeSmall organic molecule
Emp. Form.C30H30N2O3
Mol. Mass.466.5708
SMILESCOc1ccccc1C(=O)Nc1ccc(cc1)C(=O)N1CCC2(CCCC=C2)Cc2ccccc12