Reaction Details
TargetGag-Pol polyprotein [489-587]
LigandBDBM50146641
Substrate/Competitorn/a
Meas. Tech.ChEMBL_157738 (CHEMBL765176)
Ki 42±n/a nM
Citation Pierce, ACRao, GBemis, GW BREED: Generating novel inhibitors through hybridization of known ligands. Application to CDK2, p38, and HIV protease. J Med Chem47:2768-75 (2004) 
 
Gag-Pol polyprotein [489-587]
Name:Gag-Pol polyprotein [489-587]
Type:Enzyme Subunit
Mol. Mass.:10781.16
Organism:Human immunodeficiency virus type 1
Description:P04585[489-587]
Residue:99
BDBM50146641
NameBDBM50146641
Synonyms:CHEMBL96348 | {(S)-1-(R)-1-Benzyl-3-[(N-tert-Butylsulfonyl)-isobutyl-amino]-2-hydroxy-propyl}-carbamic acid (S)-(tetrahydro-furan-3-yl) ester
TypeSmall organic molecule
Emp. Form.C23H39N3O6S
Mol. Mass.485.637
SMILESCC(C)CN(C[C@@H](O)[C@H](Cc1ccccc1)NC(=O)O[C@H]1CCOC1)S(=O)(=O)NC(C)(C)C