Reaction Details
TargetEndothelin-1 receptor
LigandBDBM50146702
Substrate/Competitorn/a
Meas. Tech.ChEMBL_65482 (CHEMBL682357)
IC50 3.5±n/a nM
Citation Bolli, MHMarfurt, JGrisostomi, CBoss, CBinkert, CHess, PTreiber, AThorin, EMorrison, KBuchmann, SBur, DRamuz, HClozel, MFischli, WWeller, T Novel benzo[1,4]diazepin-2-one derivatives as endothelin receptor antagonists. J Med Chem47:2776-95 (2004) 
 
Endothelin-1 receptor
Name:Endothelin-1 receptor
Type:Enzyme Catalytic Domain
Mol. Mass.:48736.88
Organism:Homo sapiens (Human)
Description:P25101
Residue:427
BDBM50146702
NameBDBM50146702
Synonyms:(S)-(4,6-Dimethyl-pyrimidin-2-yloxy)-[(S)-1-(2-fluoro-benzyl)-2-oxo-5-phenyl-2,3,4,5-tetrahydro-1H-benzo[e][1,4]diazepin-5-yl]-acetic acid | CHEMBL96723
TypeSmall organic molecule
Emp. Form.C30H27FN4O4
Mol. Mass.526.5582
SMILESCc1cc(C)nc(O[C@H](C(O)=O)[C@]2(NCC(=O)N(Cc3ccccc3F)c3ccccc23)c2ccccc2)n1