Reaction Details
TargetEndothelin-1 receptor
LigandBDBM50146734
Substrate/Competitorn/a
Meas. Tech.ChEMBL_65482 (CHEMBL682357)
IC50 3±n/a nM
Citation Bolli, MHMarfurt, JGrisostomi, CBoss, CBinkert, CHess, PTreiber, AThorin, EMorrison, KBuchmann, SBur, DRamuz, HClozel, MFischli, WWeller, T Novel benzo[1,4]diazepin-2-one derivatives as endothelin receptor antagonists. J Med Chem47:2776-95 (2004) 
 
Endothelin-1 receptor
Name:Endothelin-1 receptor
Type:Enzyme Catalytic Domain
Mol. Mass.:48736.88
Organism:Homo sapiens (Human)
Description:P25101
Residue:427
BDBM50146734
NameBDBM50146734
Synonyms:(S)-[(S)-5-Biphenyl-3-yl-1-(4-methoxy-benzyl)-2-oxo-2,3,4,5-tetrahydro-1H-benzo[e][1,4]diazepin-5-yl]-(4,6-dimethyl-pyrimidin-2-yloxy)-acetic acid | CHEMBL316453
TypeSmall organic molecule
Emp. Form.C37H34N4O5
Mol. Mass.614.6897
SMILESCOc1ccc(CN2c3ccccc3[C@](NCC2=O)([C@H](Oc2nc(C)cc(C)n2)C(O)=O)c2cccc(c2)-c2ccccc2)cc1