Reaction Details
TargetDipeptidyl peptidase 2
LigandBDBM50146954
Substrate/Competitorn/a
Meas. Tech.ChEMBL_53368 (CHEMBL666614)
IC50 0.9±n/a nM
Citation Senten, KVan Der Veken, PDe Meester, ILambeir, AMScharpé, SHaemers, AAugustyns, K Gamma-amino-substituted analogues of 1-[(S)-2,4-diaminobutanoyl]piperidine as highly potent and selective dipeptidyl peptidase II inhibitors. J Med Chem47:2906-16 (2004) 
 
Dipeptidyl peptidase 2
Name:Dipeptidyl peptidase 2
Type:Protein
Mol. Mass.:54339.29
Organism:Homo sapiens (Human)
Description:Q9UHL4
Residue:492
BDBM50146954
NameBDBM50146954
Synonyms:2-(S)-Amino-4-phenethylamino-1-piperidin-1-yl-butan-1-one | CHEMBL317312
TypeSmall organic molecule
Emp. Form.C17H27N3O
Mol. Mass.289.4158
SMILESN[C@@H](CCNCCc1ccccc1)C(=O)N1CCCCC1