Reaction Details
TargetDipeptidyl peptidase 2
LigandBDBM50146969
Substrate/Competitorn/a
Meas. Tech.ChEMBL_53368 (CHEMBL666614)
IC50 2.7±n/a nM
Citation Senten, KVan Der Veken, PDe Meester, ILambeir, AMScharpé, SHaemers, AAugustyns, K Gamma-amino-substituted analogues of 1-[(S)-2,4-diaminobutanoyl]piperidine as highly potent and selective dipeptidyl peptidase II inhibitors. J Med Chem47:2906-16 (2004) 
 
Dipeptidyl peptidase 2
Name:Dipeptidyl peptidase 2
Type:Protein
Mol. Mass.:54339.29
Organism:Homo sapiens (Human)
Description:Q9UHL4
Residue:492
BDBM50146969
NameBDBM50146969
Synonyms:3-[((S)-3-Amino-4-oxo-4-piperidin-1-yl-butylamino)-methyl]-benzonitrile | CHEMBL330600
TypeSmall organic molecule
Emp. Form.C17H24N4O
Mol. Mass.300.3987
SMILESN[C@@H](CCNCc1cccc(c1)C#N)C(=O)N1CCCCC1