Reaction Details
TargetDipeptidyl peptidase 2
LigandBDBM50146977
Substrate/Competitorn/a
Meas. Tech.ChEMBL_53368 (CHEMBL666614)
IC50 0.66±n/a nM
Citation Senten, KVan Der Veken, PDe Meester, ILambeir, AMScharpé, SHaemers, AAugustyns, K Gamma-amino-substituted analogues of 1-[(S)-2,4-diaminobutanoyl]piperidine as highly potent and selective dipeptidyl peptidase II inhibitors. J Med Chem47:2906-16 (2004) 
 
Dipeptidyl peptidase 2
Name:Dipeptidyl peptidase 2
Type:Protein
Mol. Mass.:54339.29
Organism:Homo sapiens (Human)
Description:Q9UHL4
Residue:492
BDBM50146977
NameBDBM50146977
Synonyms:2-(S)-Amino-4-(4-methoxy-benzylamino)-1-piperidin-1-yl-butan-1-one | CHEMBL99047
TypeSmall organic molecule
Emp. Form.C17H27N3O2
Mol. Mass.305.4152
SMILESCOc1ccc(CNCC[C@H](N)C(=O)N2CCCCC2)cc1