Reaction Details
TargetDipeptidyl peptidase 2
LigandBDBM50146979
Substrate/Competitorn/a
Meas. Tech.ChEMBL_53368 (CHEMBL666614)
IC50 2.3±n/a nM
Citation Senten, KVan Der Veken, PDe Meester, ILambeir, AMScharpé, SHaemers, AAugustyns, K Gamma-amino-substituted analogues of 1-[(S)-2,4-diaminobutanoyl]piperidine as highly potent and selective dipeptidyl peptidase II inhibitors. J Med Chem47:2906-16 (2004) 
 
Dipeptidyl peptidase 2
Name:Dipeptidyl peptidase 2
Type:Protein
Mol. Mass.:54339.29
Organism:Homo sapiens (Human)
Description:Q9UHL4
Residue:492
BDBM50146979
NameBDBM50146979
Synonyms:(S)-2-Amino-4-(4-chloro-benzylamino)-1-(2-methyl-piperidin-1-yl)-butan-1-one | CHEMBL319520
TypeSmall organic molecule
Emp. Form.C17H26ClN3O
Mol. Mass.323.861
SMILESCC1CCCCN1C(=O)[C@@H](N)CCNCc1ccc(Cl)cc1