Reaction Details
TargetDipeptidyl peptidase 2
LigandBDBM50146963
Substrate/Competitorn/a
Meas. Tech.ChEMBL_53368 (CHEMBL666614)
IC50 4.6±n/a nM
Citation Senten, KVan Der Veken, PDe Meester, ILambeir, AMScharpé, SHaemers, AAugustyns, K Gamma-amino-substituted analogues of 1-[(S)-2,4-diaminobutanoyl]piperidine as highly potent and selective dipeptidyl peptidase II inhibitors. J Med Chem47:2906-16 (2004) 
 
Dipeptidyl peptidase 2
Name:Dipeptidyl peptidase 2
Type:Protein
Mol. Mass.:54339.29
Organism:Homo sapiens (Human)
Description:Q9UHL4
Residue:492
BDBM50146963
NameBDBM50146963
Synonyms:6-((S)-3-Amino-4-oxo-4-piperidin-1-yl-butylamino)-nicotinonitrile | CHEMBL418788
TypeSmall organic molecule
Emp. Form.C15H21N5O
Mol. Mass.287.3601
SMILESN[C@@H](CCNc1ccc(cn1)C#N)C(=O)N1CCCCC1