Reaction Details
TargetNeuromedin-B receptor
LigandBDBM50147041
Substrate/Competitorn/a
Meas. Tech.ChEBML_143203
IC50 1110±n/a nM
Citation Shuttleworth, SJLizarzaburu, MEChai, ACoward, P Identification and optimization of novel partial agonists of neuromedin B receptor using parallel synthesis. Bioorg Med Chem Lett14:3037-42 (2004) 
 
Neuromedin-B receptor
Name:Neuromedin-B receptor
Type:Enzyme Catalytic Domain
Mol. Mass.:43447.11
Organism:Homo sapiens (Human)
Description:Bombesin 1 NMBR 0::P28336
Residue:390
BDBM50147041
NameBDBM50147041
Synonyms:3-[3-(4-Trifluoromethyl-phenyl)-ureido]-2,3,4,9-tetrahydro-1H-carbazole-3-carboxylic acid (1-pyridin-2-yl-cyclohexylmethyl)-amide | CHEMBL105068
TypeSmall organic molecule
Emp. Form.C33H34F3N5O2
Mol. Mass.589.6506
SMILESFC(F)(F)c1ccc(NC(=O)NC2(CCc3[nH]c4ccccc4c3C2)C(=O)NCC2(CCCCC2)c2ccccn2)cc1