Reaction Details
TargetComplement C1s subcomponent
LigandBDBM50147054
Substrate/Competitorn/a
Meas. Tech.ChEBML_48032
Ki 150±n/a nM
Citation Subasinghe, NLAli, FIllig, CRJonathan Rudolph, MKlein, SKhalil, ESoll, RMBone, RFSpurlino, JCDesJarlais, RLCrysler, CSCummings, MDMorris, PEKilpatrick, JMSudhakara Babu, Y A novel series of potent and selective small molecule inhibitors of the complement component C1s. Bioorg Med Chem Lett14:3043-7 (2004) 
 
Complement C1s subcomponent
Name:Complement C1s subcomponent
Type:Protein
Mol. Mass.:76657.91
Organism:Homo sapiens (Human)
Description:P09871
Residue:688
BDBM50147054
NameBDBM50147054
Synonyms:5-Methylsulfanyl-4-[4-(1-phenyl-1H-pyrazol-4-yl)-thiazol-2-yl]-thiophene-2-carboxamidine | CHEMBL322834
TypeSmall organic molecule
Emp. Form.C18H15N5S3
Mol. Mass.397.54
SMILESCSc1sc(cc1-c1nc(cs1)-c1cnn(c1)-c1ccccc1)C(N)=N