Reaction Details
TargetComplement C1s subcomponent
LigandBDBM50099925
Substrate/Competitorn/a
Meas. Tech.ChEBML_48032
Ki 4700±n/a nM
Citation Subasinghe, NLAli, FIllig, CRJonathan Rudolph, MKlein, SKhalil, ESoll, RMBone, RFSpurlino, JCDesJarlais, RLCrysler, CSCummings, MDMorris, PEKilpatrick, JMSudhakara Babu, Y A novel series of potent and selective small molecule inhibitors of the complement component C1s. Bioorg Med Chem Lett14:3043-7 (2004) 
 
Complement C1s subcomponent
Name:Complement C1s subcomponent
Type:Protein
Mol. Mass.:76657.91
Organism:Homo sapiens (Human)
Description:P09871
Residue:688
BDBM50099925
NameBDBM50099925
Synonyms:4-(4-Cyclohexyl-thiazol-2-yl)-5-methylsulfanyl-thiophene-2-carboxamidine | CHEMBL283859
TypeSmall organic molecule
Emp. Form.C15H19N3S3
Mol. Mass.337.526
SMILESCSc1sc(cc1-c1nc(cs1)C1CCCCC1)C(N)=N