Reaction Details
TargetKallikrein-1
LigandBDBM50147092
Substrate/Competitorn/a
Meas. Tech.ChEBML_148015
Ki 1900±n/a nM
Citation Wendt, MDGeyer, AMcClellan, WJRockway, TWWeitzberg, MZhao, XMantei, RStewart, KNienaber, VKlinghofer, VGiranda, VL Interaction with the S1 beta-pocket of urokinase: 8-heterocycle substituted and 6,8-disubstituted 2-naphthamidine urokinase inhibitors. Bioorg Med Chem Lett14:3063-8 (2004) 
 
Kallikrein-1
Name:Kallikrein-1
Type:Enzyme
Mol. Mass.:28874.69
Organism:Homo sapiens (Human)
Description:P06870
Residue:262
BDBM50147092
NameBDBM50147092
Synonyms:8-Amino-naphthalene-2-carboxamidine CHEMBL319264 | uPa_15
TypeSmall organic molecule
Emp. Form.C11H11N3
Mol. Mass.185.2251
SMILESNC(=N)c1ccc2cccc(N)c2c1