Reaction Details
TargetProthrombin
LigandBDBM50147084
Substrate/Competitorn/a
Meas. Tech.ChEBML_209089
Ki 360±n/a nM
Citation Wendt, MDGeyer, AMcClellan, WJRockway, TWWeitzberg, MZhao, XMantei, RStewart, KNienaber, VKlinghofer, VGiranda, VL Interaction with the S1 beta-pocket of urokinase: 8-heterocycle substituted and 6,8-disubstituted 2-naphthamidine urokinase inhibitors. Bioorg Med Chem Lett14:3063-8 (2004) 
 
Prothrombin
Name:Prothrombin
Type:Protein
Mol. Mass.:70029.57
Organism:Homo sapiens (Human)
Description:P00734
Residue:622
BDBM50147084
NameBDBM50147084
Synonyms:6-Carbamimidoyl-4-(tetrahydro-furan-3-yl)-naphthalene-2-carboxylic acid phenylamide CHEMBL105395
TypeSmall organic molecule
Emp. Form.C22H21N3O2
Mol. Mass.359.421
SMILESNC(=N)c1ccc2cc(cc(C3CCOC3)c2c1)C(=O)Nc1ccccc1