Reaction Details
TargetTissue-type plasminogen activator
LigandBDBM50147092
Substrate/Competitorn/a
Meas. Tech.ChEBML_208233
Ki 27000±n/a nM
Citation Wendt, MDGeyer, AMcClellan, WJRockway, TWWeitzberg, MZhao, XMantei, RStewart, KNienaber, VKlinghofer, VGiranda, VL Interaction with the S1 beta-pocket of urokinase: 8-heterocycle substituted and 6,8-disubstituted 2-naphthamidine urokinase inhibitors. Bioorg Med Chem Lett14:3063-8 (2004) 
 
Tissue-type plasminogen activator
Name:Tissue-type plasminogen activator
Type:Enzyme
Mol. Mass.:62931.08
Organism:Homo sapiens (Human)
Description:n/a
Residue:562
BDBM50147092
NameBDBM50147092
Synonyms:8-Amino-naphthalene-2-carboxamidine CHEMBL319264 | uPa_15
TypeSmall organic molecule
Emp. Form.C11H11N3
Mol. Mass.185.2251
SMILESNC(=N)c1ccc2cccc(N)c2c1