Reaction Details
TargetProthrombin
LigandBDBM50147095
Substrate/Competitorn/a
Meas. Tech.ChEBML_209089
Ki 610±n/a nM
Citation Wendt, MDGeyer, AMcClellan, WJRockway, TWWeitzberg, MZhao, XMantei, RStewart, KNienaber, VKlinghofer, VGiranda, VL Interaction with the S1 beta-pocket of urokinase: 8-heterocycle substituted and 6,8-disubstituted 2-naphthamidine urokinase inhibitors. Bioorg Med Chem Lett14:3063-8 (2004) 
 
Prothrombin
Name:Prothrombin
Type:Protein
Mol. Mass.:70029.57
Organism:Homo sapiens (Human)
Description:P00734
Residue:622
BDBM50147095
NameBDBM50147095
Synonyms:6-Carbamimidoyl-4-(5-ethanesulfonyl-furan-3-yl)-naphthalene-2-carboxylic acid (3-cyclopentyloxy-phenyl)-amide | CHEMBL320233
TypeSmall organic molecule
Emp. Form.C29H29N3O5S
Mol. Mass.531.623
SMILESCCS(=O)(=O)c1cc(co1)-c1cc(cc2ccc(cc12)C(N)=N)C(=O)Nc1cccc(OC2CCCC2)c1