Reaction Details
TargetSerine protease 1
LigandBDBM50147089
Substrate/Competitorn/a
Meas. Tech.ChEBML_213066
Ki 12±n/a nM
Citation Wendt, MDGeyer, AMcClellan, WJRockway, TWWeitzberg, MZhao, XMantei, RStewart, KNienaber, VKlinghofer, VGiranda, VL Interaction with the S1 beta-pocket of urokinase: 8-heterocycle substituted and 6,8-disubstituted 2-naphthamidine urokinase inhibitors. Bioorg Med Chem Lett14:3063-8 (2004) 
 
Serine protease 1
Name:Serine protease 1
Type:Enzyme
Mol. Mass.:26557.80
Organism:Homo sapiens (Human)
Description:P07477
Residue:247
BDBM50147089
NameBDBM50147089
Synonyms:6-Carbamimidoyl-4-(tetrahydro-furan-3-yl)-naphthalene-2-carboxylic acid (3-isopropoxy-phenyl)-amide | CHEMBL421214
TypeSmall organic molecule
Emp. Form.C25H27N3O3
Mol. Mass.417.5002
SMILESCC(C)Oc1cccc(NC(=O)c2cc(C3CCOC3)c3cc(ccc3c2)C(N)=N)c1