Reaction Details
TargetSerine protease 1
LigandBDBM50147092
Substrate/Competitorn/a
Meas. Tech.ChEBML_213066
Ki 200±n/a nM
Citation Wendt, MDGeyer, AMcClellan, WJRockway, TWWeitzberg, MZhao, XMantei, RStewart, KNienaber, VKlinghofer, VGiranda, VL Interaction with the S1 beta-pocket of urokinase: 8-heterocycle substituted and 6,8-disubstituted 2-naphthamidine urokinase inhibitors. Bioorg Med Chem Lett14:3063-8 (2004) 
 
Serine protease 1
Name:Serine protease 1
Type:Enzyme
Mol. Mass.:26557.80
Organism:Homo sapiens (Human)
Description:P07477
Residue:247
BDBM50147092
NameBDBM50147092
Synonyms:8-Amino-naphthalene-2-carboxamidine CHEMBL319264 | uPa_15
TypeSmall organic molecule
Emp. Form.C11H11N3
Mol. Mass.185.2251
SMILESNC(=N)c1ccc2cccc(N)c2c1