Reaction Details
TargetUrokinase-type plasminogen activator
LigandBDBM50147097
Substrate/Competitorn/a
Meas. Tech.ChEBML_210760
Ki 4600±n/a nM
Citation Wendt, MDGeyer, AMcClellan, WJRockway, TWWeitzberg, MZhao, XMantei, RStewart, KNienaber, VKlinghofer, VGiranda, VL Interaction with the S1 beta-pocket of urokinase: 8-heterocycle substituted and 6,8-disubstituted 2-naphthamidine urokinase inhibitors. Bioorg Med Chem Lett14:3063-8 (2004) 
 
Urokinase-type plasminogen activator
Name:Urokinase-type plasminogen activator
Type:Enzyme
Mol. Mass.:48528.62
Organism:Homo sapiens (Human)
Description:P00749
Residue:431
BDBM50147097
NameBDBM50147097
Synonyms:7-Methoxy-8-(1-methyl-1H-pyrazol-4-yl)-naphthalene-2-carboxamidine | CHEMBL102631
TypeSmall organic molecule
Emp. Form.C16H16N4O
Mol. Mass.280.3244
SMILESCOc1ccc2ccc(cc2c1-c1cnn(C)c1)C(N)=N