Reaction Details
TargetTissue-type plasminogen activator
LigandBDBM50147096
Substrate/Competitorn/a
Meas. Tech.ChEBML_208233
Ki 810.0±n/a nM
Citation Wendt, MDGeyer, AMcClellan, WJRockway, TWWeitzberg, MZhao, XMantei, RStewart, KNienaber, VKlinghofer, VGiranda, VL Interaction with the S1 beta-pocket of urokinase: 8-heterocycle substituted and 6,8-disubstituted 2-naphthamidine urokinase inhibitors. Bioorg Med Chem Lett14:3063-8 (2004) 
 
Tissue-type plasminogen activator
Name:Tissue-type plasminogen activator
Type:Enzyme
Mol. Mass.:62931.08
Organism:Homo sapiens (Human)
Description:n/a
Residue:562
BDBM50147096
NameBDBM50147096
Synonyms:6-Carbamimidoyl-4-(pyrimidin-2-ylamino)-naphthalene-2-carboxylic acid phenylamide | CHEMBL104505
TypeSmall organic molecule
Emp. Form.C22H18N6O
Mol. Mass.382.4179
SMILESNC(=N)c1ccc2cc(cc(Nc3ncccn3)c2c1)C(=O)Nc1ccccc1