Reaction Details
TargetHormone-sensitive lipase
LigandBDBM50147283
Substrate/Competitorn/a
Meas. Tech.ChEMBL_88045 (CHEMBL695907)
IC50 6±n/a nM
Citation Lowe, DBMagnuson, SQi, NCampbell, AMCook, JHong, ZWang, MRodriguez, MAchebe, FKluender, HWong, WCBullock, WHSalhanick, AIWitman-Jones, TBowling, MEKeiper, CClairmont, KB In vitro SAR of (5-(2H)-isoxazolonyl) ureas, potent inhibitors of hormone-sensitive lipase. Bioorg Med Chem Lett14:3155-9 (2004) 
 
Hormone-sensitive lipase
Name:Hormone-sensitive lipase
Type:Protein
Mol. Mass.:116599.07
Organism:Homo sapiens (Human)
Description:Q05469
Residue:1076
BDBM50147283
NameBDBM50147283
Synonyms:4-Isopropyl-3-methyl-2-(4-methyl-piperidine-1-carbonyl)-2H-isoxazol-5-one CHEMBL108519
TypeSmall organic molecule
Emp. Form.C14H22N2O3
Mol. Mass.266.3361
SMILESCC(C)c1c(C)n(oc1=O)C(=O)N1CCC(C)CC1