Reaction Details
TargetHormone-sensitive lipase
LigandBDBM50147238
Substrate/Competitorn/a
Meas. Tech.ChEMBL_88045 (CHEMBL695907)
IC50 13±n/a nM
Citation Lowe, DBMagnuson, SQi, NCampbell, AMCook, JHong, ZWang, MRodriguez, MAchebe, FKluender, HWong, WCBullock, WHSalhanick, AIWitman-Jones, TBowling, MEKeiper, CClairmont, KB In vitro SAR of (5-(2H)-isoxazolonyl) ureas, potent inhibitors of hormone-sensitive lipase. Bioorg Med Chem Lett14:3155-9 (2004) 
 
Hormone-sensitive lipase
Name:Hormone-sensitive lipase
Type:Protein
Mol. Mass.:116599.07
Organism:Homo sapiens (Human)
Description:Q05469
Residue:1076
BDBM50147238
NameBDBM50147238
Synonyms:3,4-Dimethyl-2-(piperidine-1-carbonyl)-2H-isoxazol-5-one CHEMBL322780
TypeSmall organic molecule
Emp. Form.C11H16N2O3
Mol. Mass.224.2563
SMILESCc1c(C)c(=O)on1C(=O)N1CCCCC1