Reaction Details
TargetHormone-sensitive lipase
LigandBDBM50147267
Substrate/Competitorn/a
Meas. Tech.ChEMBL_88045 (CHEMBL695907)
IC50 4±n/a nM
Citation Lowe, DBMagnuson, SQi, NCampbell, AMCook, JHong, ZWang, MRodriguez, MAchebe, FKluender, HWong, WCBullock, WHSalhanick, AIWitman-Jones, TBowling, MEKeiper, CClairmont, KB In vitro SAR of (5-(2H)-isoxazolonyl) ureas, potent inhibitors of hormone-sensitive lipase. Bioorg Med Chem Lett14:3155-9 (2004) 
 
Hormone-sensitive lipase
Name:Hormone-sensitive lipase
Type:Protein
Mol. Mass.:116599.07
Organism:Homo sapiens (Human)
Description:Q05469
Residue:1076
BDBM50147267
NameBDBM50147267
Synonyms:4-Cyclohexyl-3-methyl-2-(4-methyl-piperidine-1-carbonyl)-2H-isoxazol-5-one CHEMBL110763
TypeSmall organic molecule
Emp. Form.C17H26N2O3
Mol. Mass.306.3999
SMILESCC1CCN(CC1)C(=O)n1oc(=O)c(C2CCCCC2)c1C