Reaction Details
TargetHormone-sensitive lipase
LigandBDBM50147298
Substrate/Competitorn/a
Meas. Tech.ChEBML_88045
IC50 5±n/a nM
Citation Lowe, DBMagnuson, SQi, NCampbell, AMCook, JHong, ZWang, MRodriguez, MAchebe, FKluender, HWong, WCBullock, WHSalhanick, AIWitman-Jones, TBowling, MEKeiper, CClairmont, KB In vitro SAR of (5-(2H)-isoxazolonyl) ureas, potent inhibitors of hormone-sensitive lipase. Bioorg Med Chem Lett14:3155-9 (2004) 
 
Hormone-sensitive lipase
Name:Hormone-sensitive lipase
Type:Protein
Mol. Mass.:116599.07
Organism:Homo sapiens (Human)
Description:Q05469
Residue:1076
BDBM50147298
NameBDBM50147298
Synonyms:4-Isopropyl-3-methyl-5-oxo-5H-isoxazole-2-carboxylic acid (3-fluoro-benzyl)-methyl-amide N-(3-fluorobenzyl)-4-isopropyl-N,3-dimethyl-5-oxoisoxazole-2(5H)-carboxamide
TypeSmall organic molecule
Emp. Form.C16H19FN2O3
Mol. Mass.306.3321
SMILESCC(C)c1c(C)n(oc1=O)C(=O)N(C)Cc1cccc(F)c1