Reaction Details
TargetHormone-sensitive lipase
LigandBDBM50147234
Substrate/Competitorn/a
Meas. Tech.ChEMBL_88045 (CHEMBL695907)
IC50 6±n/a nM
Citation Lowe, DBMagnuson, SQi, NCampbell, AMCook, JHong, ZWang, MRodriguez, MAchebe, FKluender, HWong, WCBullock, WHSalhanick, AIWitman-Jones, TBowling, MEKeiper, CClairmont, KB In vitro SAR of (5-(2H)-isoxazolonyl) ureas, potent inhibitors of hormone-sensitive lipase. Bioorg Med Chem Lett14:3155-9 (2004) 
 
Hormone-sensitive lipase
Name:Hormone-sensitive lipase
Type:Protein
Mol. Mass.:116599.07
Organism:Homo sapiens (Human)
Description:Q05469
Residue:1076
BDBM50147234
NameBDBM50147234
Synonyms:4-Isopropyl-3-methyl-2-(4-phenyl-piperazine-1-carbonyl)-2H-isoxazol-5-one CHEMBL110655
TypeSmall organic molecule
Emp. Form.C18H23N3O3
Mol. Mass.329.3935
SMILESCC(C)c1c(C)n(oc1=O)C(=O)N1CCN(CC1)c1ccccc1