Reaction Details
TargetHormone-sensitive lipase
LigandBDBM50147259
Substrate/Competitorn/a
Meas. Tech.ChEMBL_517 (CHEMBL615539)
IC50 8±n/a nM
Citation Lowe, DBMagnuson, SQi, NCampbell, AMCook, JHong, ZWang, MRodriguez, MAchebe, FKluender, HWong, WCBullock, WHSalhanick, AIWitman-Jones, TBowling, MEKeiper, CClairmont, KB In vitro SAR of (5-(2H)-isoxazolonyl) ureas, potent inhibitors of hormone-sensitive lipase. Bioorg Med Chem Lett14:3155-9 (2004) 
 
Hormone-sensitive lipase
Name:Hormone-sensitive lipase
Type:Protein
Mol. Mass.:116599.07
Organism:Homo sapiens (Human)
Description:Q05469
Residue:1076
BDBM50147259
NameBDBM50147259
Synonyms:4-Cyclopentyl-3-methyl-2-(4-phenyl-piperidine-1-carbonyl)-2H-isoxazol-5-one CHEMBL320708
TypeSmall organic molecule
Emp. Form.C21H26N2O3
Mol. Mass.354.4427
SMILESCc1c(C2CCCC2)c(=O)on1C(=O)N1CCC(CC1)c1ccccc1