Reaction Details
TargetHormone-sensitive lipase
LigandBDBM50147262
Substrate/Competitorn/a
Meas. Tech.ChEBML_88045
IC50 8±n/a nM
Citation Lowe, DBMagnuson, SQi, NCampbell, AMCook, JHong, ZWang, MRodriguez, MAchebe, FKluender, HWong, WCBullock, WHSalhanick, AIWitman-Jones, TBowling, MEKeiper, CClairmont, KB In vitro SAR of (5-(2H)-isoxazolonyl) ureas, potent inhibitors of hormone-sensitive lipase. Bioorg Med Chem Lett14:3155-9 (2004) 
 
Hormone-sensitive lipase
Name:Hormone-sensitive lipase
Type:Protein
Mol. Mass.:116599.07
Organism:Homo sapiens (Human)
Description:Q05469
Residue:1076
BDBM50147262
NameBDBM50147262
Synonyms:4-Isopropyl-3-methyl-2-(thiomorpholine-4-carbonyl)-2H-isoxazol-5-one CHEMBL324436
TypeSmall organic molecule
Emp. Form.C12H18N2O3S
Mol. Mass.270.348
SMILESCC(C)c1c(C)n(oc1=O)C(=O)N1CCSCC1