Reaction Details
TargetHormone-sensitive lipase
LigandBDBM50147264
Substrate/Competitorn/a
Meas. Tech.ChEBML_88045
IC50 11±n/a nM
Citation Lowe, DBMagnuson, SQi, NCampbell, AMCook, JHong, ZWang, MRodriguez, MAchebe, FKluender, HWong, WCBullock, WHSalhanick, AIWitman-Jones, TBowling, MEKeiper, CClairmont, KB In vitro SAR of (5-(2H)-isoxazolonyl) ureas, potent inhibitors of hormone-sensitive lipase. Bioorg Med Chem Lett14:3155-9 (2004) 
 
Hormone-sensitive lipase
Name:Hormone-sensitive lipase
Type:Protein
Mol. Mass.:116599.07
Organism:Homo sapiens (Human)
Description:Q05469
Residue:1076
BDBM50147264
NameBDBM50147264
Synonyms:4-Cyclohexyl-3-methyl-2-(piperidine-1-carbonyl)-2H-isoxazol-5-one CHEMBL323458
TypeSmall organic molecule
Emp. Form.C16H24N2O3
Mol. Mass.292.3734
SMILESCc1c(C2CCCCC2)c(=O)on1C(=O)N1CCCCC1