Reaction Details
TargetDNA topoisomerase 2-alpha
LigandBDBM50147400
Substrate/Competitorn/a
Meas. Tech.ChEBML_54503
IC50 38000±n/a nM
Citation Wang, BBMaghami, NGoodlin, VLSmith, PJ Critical structural motif for the catalytic inhibition of human topoisomerase II by UK-1 and analogs. Bioorg Med Chem Lett14:3221-6 (2004) 
 
DNA topoisomerase 2-alpha
Name:DNA topoisomerase 2-alpha
Type:Protein
Mol. Mass.:174415.30
Organism:Homo sapiens (Human)
Description:P11388
Residue:1531
BDBM50147400
NameBDBM50147400
Synonyms:2'-Phenyl-[2,4']bibenzooxazolyl-4-carboxylic acid methyl ester | CHEMBL324426
TypeSmall organic molecule
Emp. Form.C22H14N2O4
Mol. Mass.370.3576
SMILESCOC(=O)c1cccc2oc(nc12)-c1cccc2oc(nc12)-c1ccccc1