Reaction Details
TargetProtein kinase C alpha type
LigandBDBM50147467
Substrate/Competitorn/a
Meas. Tech.ChEBML_152986
IC50 1400±n/a nM
Citation Zhang, HCYe, HConway, BRDerian, CKAddo, MFKuo, GHHecker, LRCroll, DRLi, JWestover, LXu, JZLook, RDemarest, KTAndrade-Gordon, PDamiano, BPMaryanoff, BE 3-(7-Azaindolyl)-4-arylmaleimides as potent, selective inhibitors of glycogen synthase kinase-3. Bioorg Med Chem Lett14:3245-50 (2004) 
 
Protein kinase C alpha type
Name:Protein kinase C alpha type
Type:Enzyme
Mol. Mass.:76755.65
Organism:Homo sapiens (Human)
Description:The recombinant human PKC enzymes were produced using a baculovirus expression system in SF9 cells
Residue:672
BDBM50147467
NameBDBM50147467
Synonyms:3-[1-(3-Dimethylamino-propyl)-1H-pyrrolo[2,3-b]pyridin-3-yl]-4-naphthalen-1-yl-pyrrole-2,5-dione | CHEMBL326688
TypeSmall organic molecule
Emp. Form.C26H24N4O2
Mol. Mass.424.4944
SMILESCN(C)CCCn1cc(C2=C(C(=O)NC2=O)c2cccc3ccccc23)c2cccnc12