Reaction Details
TargetGlycogen synthase kinase-3 beta
LigandBDBM50147469
Substrate/Competitorn/a
Meas. Tech.ChEBML_71154
IC50 31±n/a nM
Citation Zhang, HCYe, HConway, BRDerian, CKAddo, MFKuo, GHHecker, LRCroll, DRLi, JWestover, LXu, JZLook, RDemarest, KTAndrade-Gordon, PDamiano, BPMaryanoff, BE 3-(7-Azaindolyl)-4-arylmaleimides as potent, selective inhibitors of glycogen synthase kinase-3. Bioorg Med Chem Lett14:3245-50 (2004) 
 
Glycogen synthase kinase-3 beta
Name:Glycogen synthase kinase-3 beta
Type:Enzyme
Mol. Mass.:46756.38
Organism:Homo sapiens (Human)
Description:P49841
Residue:420
BDBM50147469
NameBDBM50147469
Synonyms:3-[1-(3-Hydroxy-propyl)-1H-pyrrolo[2,3-b]pyridin-3-yl]-4-naphthalen-1-yl-pyrrole-2,5-dione | CHEMBL430694
TypeSmall organic molecule
Emp. Form.C24H19N3O3
Mol. Mass.397.426
SMILESOCCCn1cc(C2=C(C(=O)NC2=O)c2cccc3ccccc23)c2cccnc12