Reaction Details
TargetGlycogen synthase kinase-3 beta
LigandBDBM8296
Substrate/Competitorn/a
Meas. Tech.ChEMBL_79695 (CHEMBL691714)
EC50 200±n/a nM
Citation Zhang, HCYe, HConway, BRDerian, CKAddo, MFKuo, GHHecker, LRCroll, DRLi, JWestover, LXu, JZLook, RDemarest, KTAndrade-Gordon, PDamiano, BPMaryanoff, BE 3-(7-Azaindolyl)-4-arylmaleimides as potent, selective inhibitors of glycogen synthase kinase-3. Bioorg Med Chem Lett14:3245-50 (2004) 
 
Glycogen synthase kinase-3 beta
Name:Glycogen synthase kinase-3 beta
Type:Enzyme
Mol. Mass.:46756.38
Organism:Homo sapiens (Human)
Description:P49841
Residue:420
BDBM8296
NameBDBM8296
Synonyms:3-(2,4-dichlorophenyl)-4-(1-methyl-1H-indol-3-yl)-2,5-dihydro-1H-pyrrole-2,5-dione SB-216763 | cid_176158
TypeSmall organic molecule
Emp. Form.C19H12Cl2N2O2
Mol. Mass.371.217
SMILESCn1cc(C2=C(C(=O)NC2=O)c2ccc(Cl)cc2Cl)c2ccccc12