Reaction Details
TargetProtein kinase C beta type
LigandBDBM50147464
Substrate/Competitorn/a
Meas. Tech.ChEBML_152990
IC50 2730±n/a nM
Citation Zhang, HCYe, HConway, BRDerian, CKAddo, MFKuo, GHHecker, LRCroll, DRLi, JWestover, LXu, JZLook, RDemarest, KTAndrade-Gordon, PDamiano, BPMaryanoff, BE 3-(7-Azaindolyl)-4-arylmaleimides as potent, selective inhibitors of glycogen synthase kinase-3. Bioorg Med Chem Lett14:3245-50 (2004) 
 
Protein kinase C beta type
Name:Protein kinase C beta type
Type:Enzyme
Mol. Mass.:76873.67
Organism:Homo sapiens (Human)
Description:The recombinant human PKC enzymes were produced using a baculovirus expression system in SF9 cells
Residue:671
BDBM50147464
NameBDBM50147464
Synonyms:CHEMBL109977 | N-(3-{3-[4-(2-Methoxy-phenyl)-2,5-dioxo-2,5-dihydro-1H-pyrrol-3-yl]-pyrrolo[2,3-b]pyridin-1-yl}-propyl)-formamide
TypeSmall organic molecule
Emp. Form.C22H20N4O4
Mol. Mass.404.4186
SMILESCOc1ccccc1C1=C(C(=O)NC1=O)c1cn(CCCNC=O)c2ncccc12