Reaction Details
TargetProtein kinase C beta type
LigandBDBM50147466
Substrate/Competitorn/a
Meas. Tech.ChEBML_152990
IC50 1070±n/a nM
Citation Zhang, HCYe, HConway, BRDerian, CKAddo, MFKuo, GHHecker, LRCroll, DRLi, JWestover, LXu, JZLook, RDemarest, KTAndrade-Gordon, PDamiano, BPMaryanoff, BE 3-(7-Azaindolyl)-4-arylmaleimides as potent, selective inhibitors of glycogen synthase kinase-3. Bioorg Med Chem Lett14:3245-50 (2004) 
 
Protein kinase C beta type
Name:Protein kinase C beta type
Type:Enzyme
Mol. Mass.:76873.67
Organism:Homo sapiens (Human)
Description:The recombinant human PKC enzymes were produced using a baculovirus expression system in SF9 cells
Residue:671
BDBM50147466
NameBDBM50147466
Synonyms:3-(1-Ethyl-1H-pyrrolo[2,3-b]pyridin-3-yl)-4-[1-(3-hydroxy-propyl)-1H-pyrrolo[2,3-b]pyridin-3-yl]-pyrrole-2,5-dione | CHEMBL110000
TypeSmall organic molecule
Emp. Form.C23H21N5O3
Mol. Mass.415.4445
SMILESCCn1cc(C2=C(C(=O)NC2=O)c2cn(CCCO)c3ncccc23)c2cccnc12