Reaction Details
TargetProtein kinase C gamma type
LigandBDBM50147468
Substrate/Competitorn/a
Meas. Tech.ChEBML_153125
IC50 6000±n/a nM
Citation Zhang, HCYe, HConway, BRDerian, CKAddo, MFKuo, GHHecker, LRCroll, DRLi, JWestover, LXu, JZLook, RDemarest, KTAndrade-Gordon, PDamiano, BPMaryanoff, BE 3-(7-Azaindolyl)-4-arylmaleimides as potent, selective inhibitors of glycogen synthase kinase-3. Bioorg Med Chem Lett14:3245-50 (2004) 
 
Protein kinase C gamma type
Name:Protein kinase C gamma type
Type:Enzyme
Mol. Mass.:78458.05
Organism:Homo sapiens (Human)
Description:The recombinant human PKC enzymes were produced using a baculovirus expression system in SF9 cells
Residue:697
BDBM50147468
NameBDBM50147468
Synonyms:3-(7-Azaindolyl)-4-arylmaleimide analogue | CHEMBL423323
TypeSmall organic molecule
Emp. Form.C21H21N5O5S
Mol. Mass.455.487
SMILESCOc1ccccc1C1=C(C(=O)NC1=O)c1cn(CCCNS(N)(=O)=O)c2ncccc12