Reaction Details
TargetHeparanase
LigandBDBM50147537
Substrate/Competitorn/a
Meas. Tech.ChEBML_83907
IC50 400±n/a nM
Citation Courtney, SMHay, PABuck, RTColville, CSPorter, DWScopes, DIPollard, FCPage, MJBennett, JMHircock, MLMcKenzie, EAStubberfield, CRTurner, PR 2,3-Dihydro-1,3-dioxo-1H-isoindole-5-carboxylic acid derivatives: a novel class of small molecule heparanase inhibitors. Bioorg Med Chem Lett14:3269-73 (2004) 
 
Heparanase
Name:Heparanase
Type:PROTEIN
Mol. Mass.:61167.67
Organism:Homo sapiens (Human)
Description:ChEMBL_327900
Residue:543
BDBM50147537
NameBDBM50147537
Synonyms:2-(5-(5-(4-fluorophenyl)benzo[d]oxazol-2-yl)-2-methoxyphenyl)-1,3-dioxoisoindoline-5-carboxylic acid CHEMBL324065
TypeSmall organic molecule
Emp. Form.C29H17FN2O6
Mol. Mass.508.4535
SMILESCOc1ccc(cc1N1C(=O)c2ccc(cc2C1=O)C(O)=O)-c1nc2cc(ccc2o1)-c1ccc(F)cc1