Reaction Details
TargetHeparanase
LigandBDBM50147539
Substrate/Competitorn/a
Meas. Tech.ChEBML_83907
IC50 450±n/a nM
Citation Courtney, SMHay, PABuck, RTColville, CSPorter, DWScopes, DIPollard, FCPage, MJBennett, JMHircock, MLMcKenzie, EAStubberfield, CRTurner, PR 2,3-Dihydro-1,3-dioxo-1H-isoindole-5-carboxylic acid derivatives: a novel class of small molecule heparanase inhibitors. Bioorg Med Chem Lett14:3269-73 (2004) 
 
Heparanase
Name:Heparanase
Type:PROTEIN
Mol. Mass.:61167.67
Organism:Homo sapiens (Human)
Description:ChEMBL_327900
Residue:543
BDBM50147539
NameBDBM50147539
Synonyms:2-(2-methoxy-5-(5-(4-methoxyphenyl)benzo[d]oxazol-2-yl)phenyl)-1,3-dioxoisoindoline-5-carboxylic acid CHEMBL109779
TypeSmall organic molecule
Emp. Form.C30H20N2O7
Mol. Mass.520.489
SMILESCOc1ccc(cc1)-c1ccc2oc(nc2c1)-c1ccc(OC)c(c1)N1C(=O)c2ccc(cc2C1=O)C(O)=O