Reaction Details
TargetDynamin-1
LigandBDBM50147559
Substrate/Competitorn/a
Meas. Tech.ChEBML_60874
IC50 14930±n/a nM
Citation Hill, TAOdell, LRQuan, AAbagyan, RFerguson, GRobinson, PJMcCluskey, A Long chain amines and long chain ammonium salts as novel inhibitors of dynamin GTPase activity. Bioorg Med Chem Lett14:3275-8 (2004) 
 
Dynamin-1
Name:Dynamin-1
Type:PROTEIN
Mol. Mass.:97411.67
Organism:Homo sapiens (Human)
Description:ChEMBL_1458576
Residue:864
BDBM50147559
NameBDBM50147559
Synonyms:CHEMBL110310 Tetradecyl-ammonium; bromide
TypeSmall organic molecule
Emp. Form.C14H32N
Mol. Mass.214.41
[NH3+]