Reaction Details
TargetDynamin-1
LigandBDBM50147565
Substrate/Competitorn/a
Meas. Tech.ChEBML_60874
IC50 10190±n/a nM
Citation Hill, TAOdell, LRQuan, AAbagyan, RFerguson, GRobinson, PJMcCluskey, A Long chain amines and long chain ammonium salts as novel inhibitors of dynamin GTPase activity. Bioorg Med Chem Lett14:3275-8 (2004) 
 
Dynamin-1
Name:Dynamin-1
Type:PROTEIN
Mol. Mass.:97411.67
Organism:Homo sapiens (Human)
Description:ChEMBL_1458576
Residue:864
BDBM50147565
NameBDBM50147565
Synonyms:CHEMBL110738 | Tributyl-hexadecyl-phosphonium; bromide
TypeSmall organic molecule
Emp. Form.C28H60P
Mol. Mass.427.7492
[P+](CCCC)(CCCC)CCCC