Reaction Details
TargetDynamin-1
LigandBDBM50147569
Substrate/Competitorn/a
Meas. Tech.ChEBML_60874
IC50 10160±n/a nM
Citation Hill, TAOdell, LRQuan, AAbagyan, RFerguson, GRobinson, PJMcCluskey, A Long chain amines and long chain ammonium salts as novel inhibitors of dynamin GTPase activity. Bioorg Med Chem Lett14:3275-8 (2004) 
 
Dynamin-1
Name:Dynamin-1
Type:PROTEIN
Mol. Mass.:97411.67
Organism:Homo sapiens (Human)
Description:ChEMBL_1458576
Residue:864
BDBM50147569
NameBDBM50147569
Synonyms:CHEMBL112909 | Tetradecanoic acid (2-amino-1-aminomethyl-ethyl)-ammonium bromide
TypeSmall organic molecule
Emp. Form.C17H39N3O
Mol. Mass.301.51
(=O)NC(C[NH3+])C[NH3+]