Reaction Details
TargetDynamin-1
LigandBDBM50060580
Substrate/Competitorn/a
Meas. Tech.ChEBML_60874
IC50 10140±n/a nM
Citation Hill, TAOdell, LRQuan, AAbagyan, RFerguson, GRobinson, PJMcCluskey, A Long chain amines and long chain ammonium salts as novel inhibitors of dynamin GTPase activity. Bioorg Med Chem Lett14:3275-8 (2004) 
 
Dynamin-1
Name:Dynamin-1
Type:PROTEIN
Mol. Mass.:97411.67
Organism:Homo sapiens (Human)
Description:ChEMBL_1458576
Residue:864
BDBM50060580
NameBDBM50060580
Synonyms:CHEMBL324402 | Dodecyl-ethyl-dimethyl-ammonium; bromide
TypeSmall organic molecule
Emp. Form.C16H36N
Mol. Mass.242.4632
SMILESCCCCCCCCCCCC[N+](C)(C)CC